{"text_format":"1","workbook":"xlsx","n_sheets":4,"sheets":["2019年度採用申請書","採用申請提出方法","CD表","労働条件記入方法"],"not_rendered":{"charts":0,"images":3,"macros":1,"external_links":0,"defined_names":6,"comments":0,"pivot_tables":0},"unopened":[],"bounds":{"document_bytes":16777216,"sheet_cells":100000,"rows_first":2000,"rows_last":500,"rows_between":2000,"halvings":0,"cell_chars":16384,"cell_head_chars":4096},"cells_cut":0,"cells_raw":0,"read":"whole","date_system":"1900"}

{"sheet":"2019年度採用申請書","index":0,"n_rows":192,"n_cols":19,"rows_kept":192,"cut":false,"hidden":false,"merged":[[1,3,1,5],[3,2,3,10],[5,4,5,6],[5,8,5,10],[6,4,6,6],[6,8,6,10],[7,4,7,6],[8,4,8,6],[11,1,16,1],[11,2,13,2],[11,4,11,6],[11,8,11,10],[11,14,13,14],[11,15,13,15],[12,4,12,6],[12,8,12,10],[13,8,13,10],[14,2,16,2],[19,2,20,3],[19,4,19,6],[20,4,20,6],[21,2,21,3],[21,4,21,6],[22,2,22,3],[22,4,22,6],[14,4,14,6],[14,8,14,10],[15,4,15,6],[15,8,15,10],[16,8,16,10],[18,2,18,3],[18,4,18,6],[27,2,27,3],[27,4,27,10],[31,6,31,8],[31,9,31,10],[33,2,39,2],[33,9,33,10],[34,9,34,10],[35,9,35,10],[25,2,25,3],[25,4,25,6],[25,8,25,10],[26,2,26,3],[26,4,26,10],[41,2,41,3],[41,4,41,5],[42,2,42,3],[42,4,42,6],[43,2,43,3],[43,4,43,10],[35,15,36,15],[36,9,36,10],[37,9,37,10],[38,9,38,10],[39,9,39,10],[40,2,40,3],[40,4,40,5],[47,2,47,3],[47,4,47,10],[49,2,49,3],[49,4,49,10],[51,2,51,3],[51,4,51,6],[51,7,51,8],[51,9,51,10],[45,2,45,3],[45,4,45,6],[45,7,45,8],[45,9,45,10],[46,2,46,3],[46,4,46,6],[58,2,58,3],[58,4,58,10],[61,2,61,3],[61,4,61,10],[62,2,62,3],[62,4,62,10],[53,2,53,3],[53,4,53,6],[56,2,56,3],[56,4,56,10],[57,2,57,3],[57,4,57,10],[68,14,70,14],[68,15,70,15],[69,4,69,6],[69,8,69,10],[70,4,70,6],[70,8,70,10],[63,2,63,3],[63,4,63,10],[64,2,64,3],[64,4,64,10],[65,2,65,3],[65,4,65,10],[71,2,73,2],[71,4,71,10],[72,4,72,6],[72,8,72,10],[73,4,73,6],[73,8,73,10],[66,2,66,3],[66,4,66,10],[68,2,70,2],[68,4,68,10],[77,2,79,2],[77,4,77,10],[78,4,78,6],[78,8,78,10],[79,4,79,6],[79,8,79,10],[74,2,76,2],[74,4,74,10],[75,4,75,6],[75,8,75,10],[76,4,76,6],[76,8,76,10],[81,2,83,2],[81,4,81,10],[81,14,83,14],[81,15,83,15],[82,4,82,6],[82,8,82,10],[83,4,83,6],[83,8,83,10],[84,2,86,2],[84,4,84,10],[85,4,85,6],[85,8,85,10],[86,4,86,6],[86,8,86,10],[87,2,89,2],[87,4,87,10],[88,4,88,6],[88,8,88,10],[89,4,89,6],[93,2,95,2],[93,4,93,10],[94,4,94,6],[94,8,94,10],[95,4,95,6],[95,8,95,10],[89,8,89,10],[90,2,92,2],[90,4,90,10],[91,4,91,6],[91,8,91,10],[92,4,92,6],[92,8,92,10],[99,4,99,10],[100,4,100,6],[100,8,100,9],[101,4,101,6],[101,8,101,10],[96,2,98,2],[96,4,96,10],[97,4,97,6],[97,8,97,10],[98,4,98,6],[98,8,98,10],[23,4,23,6],[23,2,23,3],[106,3,108,3],[106,4,108,6],[109,3,111,3],[109,4,111,6],[81,1,98,1],[124,4,124,6],[5,2,9,2],[24,2,24,3],[24,4,24,6],[115,3,117,3],[115,4,117,6],[112,2,117,2],[112,3,114,3],[112,4,114,6],[106,2,111,2],[102,2,104,2],[102,4,102,10],[103,4,103,6],[103,8,103,9],[104,4,104,6],[104,8,104,10],[99,2,101,2]]}
[null,null,null,null,null,null,null,null,null,null,null,null,null,null,null,null,null,null,{"$f":"\"'\"&TEXT(NOW(),\"yyyy/mm/dd hh:mm:ss\")&\"','000000','\"& IF(LEFT($E19,2)=\"06\",\"6\",\"1\")&\"','0','9999/12/31','0','9999/12/31','0','9999/12/31',\"&S6&\", \"&S19&\", \"&S32&\", \"&S46&\", \"&S68","v":"'2019/09/13 14:22:32','000000','1','0','9999/12/31','0','9999/12/31','0','9999/12/31','', '', '', '', '1900/01/00', '', '', '', '', '', '', '1900/01/00', '', '', '', '', '', '1900/01/00', '1900/01/00', '', '00:00', '00:00', '00:00', '00:00', '00:00', '00:00', '00:00', '00:00', '00:00', '00:00', '00:00', '00:00', '00:00', '00:00', 'FALSE', 'FALSE', 'FALSE', 'FALSE', 'FALSE', 'FALSE', 'FALSE', '', '', '', '', '', '', '', '0', '0', '日曜', '', 'FALSE', '', '', '0', '0', '0', '0', '経常費', '', '', '', '', '', '', '', '', '','', '','', '','', '','', '','', '','', '','', '','', '','', '','', '','', '','', '', '', '','', '', '', '','', '', '', ''"}]
[null,null,"申請日",null,null,null,null,null,null,null,null,null,null,null,"採用申請書　記入方法"]
[null,null,null,null,null,null,null,null,null,null,null,null,null,null,"項目","説明"]
[null,null,"臨時職員（アルバイト）採用申請書　　　",null,null,null,null,null,null,null,null,null,null,null,"様式全体","ピンク色の欄は記入必須、水色の欄は記入任意、灰色の欄は記入不要です。"]
[null,null,null,null,null,null,null,null,null,null,null,null,null,null,"申請日","本申請書を作成した年月日を記入してください。"]
[null,"1.　被雇用者","被雇用者","教職員番号",null,null,null,"フリガナ",null,null,null,null,null,null,null,null,null,null,{"$f":"\"'\"&LEFTB(ASC(E6),6)&\"', '\"&LEFTB(I7,40)&\"', '\"&LEFTB(I6,40)&\"', '\"&LEFTB(ASC(E8),8)&\"', '\"&LEFTB(TEXT(E9,\"yyyy/mm/dd\"),10)&\"', '\"&LEFTB(ASC(I8),3)&\"', '\"&LEFTB(I9,1)&\"', '\"&LEFTB(I12,6)&\"', '\"&LEFTB(I14,50)&\"', '\"&LEFTB(I15,6)&\"', '\"&LEFTB(I17,50)&\"'\"","v":"'', '', '', '', '1900/01/00', '', '', '', '', '', ''"}]
[null,null,null,"種別",null,null,null,"氏名",null,null,null,null,null,null,"教職員番号","新規採用で番号が付与されていない場合や不明な場合は、空欄で結構です。雇用契約書に記載し通知します。"]
[null,null,null,"学籍番号\n（塾生は記入必須）",null,null,null,"国籍CD",null,"国名",{"$f":"IF(ISERROR(VLOOKUP($I$8,CD表!$E$13:$F$74,2,FALSE)),\"\",VLOOKUP($I$8,CD表!$E$13:$F$74,2,FALSE))","v":""},null,null,null,"国籍CD／性別CD","国籍CDは、別シートの【CD表】を参照のうえ、3桁のコードを記入してください。主な国籍CDは、392（日本）・156（中国）・356（インド）・410（大韓民国）・826（英国）・840（米国）です。\n性別CDは、1.男、2.女です。"]
[null,null,null,"期間満了予定日\n（最長任用予定日）",null,null,null,"性別CD",null,"性別",{"$f":"IF(I9=1,\"男\",IF(I9=2,\"女\",\"\"))","v":""},null,null,null,"期間満了予定日（最長任用予定日）","不明な場合は、空欄で結構です。雇用契約書に記載し通知します。"]
[null,null,null,"システムによる\n自動メール送信",null,null,null,null,null,null,null,null,null,null,"システムによる自動メール送信","「1.送信する」を選択した場合、システムから有給休暇の発生や交通費申請の承認など、メールが自動で送信されます。 1.送信する、2:送信しない　です。"]
[]
[null,"登録希望の\n場合のみ記入","勤務入力代行者1","所属",null,null,null,"教職員番号",null,null,null,null,null,null,"勤務入力代行者\n※登録希望の場合のみ記入","臨時職員勤務管理システムによる勤怠申請に移行した場合、原則、本人に勤怠申請をしていただきますが、勤務入力代行者を設定すると、勤務管理\nシステム上で勤怠申請を行う権限が与えられます。申請したい場合は、記入してください。最大2名まで設定が可能です。\nただし、勤務管理責任者（所属長）は勤務入力代行者になれません。"]
[null,null,null,"身分","2.　職員",null,null,"氏名"]
[null,null,null,null,null,null,null,"e-mail"]
[null,null,"勤務入力代行者2","所属",null,null,null,"教職員番号",null,null,null,null,null,null,"e-mail","職員の方でADSTmailを利用している場合は、入力不要です。教職員番号は必ず記入してください。"]
[null,null,null,"身分","1.　教員",null,null,"氏名"]
[null,null,null,null,null,null,null,"e-mail"]
[]
[null,"2.　申請情報","所属地区",null,null,null,null,null,null,null,null,null,null,null,"所属地区","プルダウンより選択してください。",null,null,{"$f":"\"'\"&LEFTB(TEXT(D2,\"yyyy/mm/dd\"),10)&\"', '\"&LEFTB(E19,2)&\"', '\"&LEFTB(E20,2)&\"', '\"&LEFTB(E21,40)&\"', '\"&LEFTB(E22,7)&\"', '\"&LEFTB(E24,3)&\"', '\"&LEFTB(TEXT(E26,\"yyyy/mm/dd\"),10)&\"', '\"&LEFTB(TEXT(I26,\"yyyy/mm/dd\"),10)&\"', '\"&LEFTB(E27,200)&\"'\"","v":"'1900/01/00', '', '', '', '', '', '1900/01/00', '1900/01/00', ''"}]
[null,null,"勤務地区",null,null,null,null,"※所属地区と異なる場合のみ、プルダウンより選択"]
[null,null,null,null,null,null,null,"※勤務地が塾外の場合は必ず記入"]
[null,null,"所属CD",null,null,null,null,null,null,null,null,null,null,null,"所属CD","別シートの【CD表】を参照のうえ、7桁のコードを記入してください。従来の採用申請書の「事務担当」の所属CDを記入してください。"]
[null,null,"所属名",null,{"$f":"IF(ISERROR(VLOOKUP($E$22,CD表!$B$3:$C$547,2,FALSE)),\"\",VLOOKUP($E$22,CD表!$B$3:$C$547,2,FALSE))","v":""}]
[]
[null,null,"申請区分",null,null,null,null,null,null,null,null,null,null,null,"申請区分","プルダウンより選択してください。"]
[null,null,"申請期間",null,null,null,null,"～",null,null,null,null,null,null,"申請期間","臨時職員は単年度契約のため、最長期間は1年です。\n注：業務の依頼をする可能性がある期間について申請してください。申請期間は、雇用年限や有給休暇発生にも影響します。"]
[null,null,"業務内容",null,null,null,null,null,null,null,null,null,null,null,"業務内容","雇用契約書上に、「従事すべき業務の内容は、義塾における【業務内容】とする。」という文章で印字されますので、【研究補助業務】、【事務補助業務】のように\n簡潔に記入してください。最大45文字です。"]
[null,null,"採用申請理由",null,null,null,null,null,null,null,null,null,null,null,"採用申請理由","前任者の退職、繁忙による人員増加等の理由があれば、記入してください。"]
[]
[null,"3.　労働条件","①②のいずれかを選択してください。",null,null,null,null,null,null,null,null,null,null,null,"労働条件","別シートの【労働条件記入方法】をご参照のうえ、①または②を選択し、必要項目を記入してください。"]
[null,null,1]
[null,null,null,null,null,null,"1日の労働時間が6時間超の場合必ずチェック↓",null,null,"備考①↓",null,null,null,null,null,null,null,null,{"$f":"\"'\"&TEXT(E34,\"hh:mm\")&\"', '\"&TEXT(G34,\"hh:mm\")&\"', '\"&TEXT(E35,\"hh:mm\")&\"', '\"&TEXT(G35,\"hh:mm\")&\"', '\"&TEXT(E36,\"hh:mm\")&\"', '\"&TEXT(G36,\"hh:mm\")&\"', '\"&TEXT(E37,\"hh:mm\")&\"', '\"&TEXT(G37,\"hh:mm\")&\"', '\"&TEXT(E38,\"hh:mm\")&\"', '\"&TEXT(G38,\"hh:mm\")&\"', '\"&TEXT(E39,\"hh:mm\")&\"', '\"&TEXT(G39,\"hh:mm\")&\"', '\"&TEXT(E40,\"hh:mm\")&\"', '\"&TEXT(G40,\"hh:mm\")&\"', '\"&H34&\"', '\"&H35&\"', '\"&H36&\"', '\"&H37&\"', '\"&H38&\"', '\"&H39&\"', '\"&H40&\"', '\"&LEFTB(J34,80)&\"', '\"&LEFTB(J35,80)&\"', '\"&LEFTB(J36,80)&\"', '\"&LEFTB(J37,80)&\"', '\"&LEFTB(J38,80)&\"', '\"&LEFTB(J39,80)&\"', '\"&LEFTB(J40,80)&\"', '\"&LEFT(E41,2)&\"', '\"&LEFT(E42,4)&\"', '\"&LEFT(E43,2)&\"', '\"&LEFTB(E44,150)&\"', '\"&LEFT(I142,5)&\"'\"","v":"'00:00', '00:00', '00:00', '00:00', '00:00', '00:00', '00:00', '00:00', '00:00', '00:00', '00:00', '00:00', '00:00', '00:00', 'FALSE', 'FALSE', 'FALSE', 'FALSE', 'FALSE', 'FALSE', 'FALSE', '', '', '', '', '', '', '', '0', '0', '日曜', '', 'FALSE'"}]
[]
[null,null,"所定曜日毎の\n始業・終業時刻","日",null,"～",null,false,null,null,null,null,null,null,"所定曜日毎の始業・終業時刻","①を選択した場合のみ、各曜日の始業・終業時刻を記入してください。"]
[null,null,null,"月",null,"～",null,false,null,null,null,null,null,null,"休憩1時間取得","①を選択した場合で、1日の労働時間が6時間を超える場合は、必ずチェックしてください。"]
[null,null,null,"火",null,"～",null,false,null,null,null,null,null,null,"備考①","①を選択した場合で、30分、2時間等の1時間以外の休憩時間を取得する場合は、実際の労働時間を記入してください。\nあわせて、必ず始業・終業時刻を適宜調整のうえ、記入してください。"]
[null,null,null,"水",null,"～",null,false]
[null,null,null,"木",null,"～",null,false,null,null,null,null,null,null,null,"　　　例）　9:00-10:00（1時間労働）、10:00-15:00（5時間休憩）、15:00-22:00（7時間労働）　合計：8時間労働、休憩5時間　の場合"]
[null,null,null,"金",null,"～",null,false,null,null,null,null,null,null,null,"　　　　　　　　備考①欄　　　　　 　 ：実際の労働時間について「労働時間：9:00-10:00､15:00-22:00」と記入してください。雇用契約書に印字されます。"]
[null,null,null,"土",null,"～",null,false,null,null,null,null,null,null,null,"　　　　 　　　　始業・終業時刻欄   ：9:00-18:00（休憩1時間取得にチェック）　or 13:00-22:00（休憩1時間取得にチェック）　のように適宜調整のうえ、記入してください。"]
[null,null,"週労働日数",null,{"$f":"COUNT(E34:E40)","v":0},null,"日",null,null,null,null,null,null,null,"週労働日数","自動計算にて数値が記入されます。修正不可です。"]
[null,null,"週労働時間数",null,{"$f":"K139","v":0},null,"時間",null,null,null,null,null,null,null,"週労働時間数","自動計算にて数値が記入されます。修正不可です。"]
[null,null,"法定休日",null,"日曜",null,null,null,null,null,null,null,null,null,"法定休日","日曜日を契約曜日とする場合には、別の曜日を選択してください。申請期間が1週間未満の場合は、法定休日の設定は不要です。"]
[null,null,"備考②",null,null,null,null,null,null,null,null,null,null,null,"備考②","②を選択した場合、別シートの【労働条件記入方法】を参照のうえ、必ず記入してください。シフト表が作成されている場合は、人事部人事企画担当まで提出してください。"]
[]
[null,null,"時給種別CD",null,null,null,null,"時給種別",null,"",null,null,null,null,"時給種別CD","別シートの【CD表】を参照のうえ、3桁のコードを直接記入するか、またはプルダウンより選択してください。CD表の備考を確認のうえ、誤りがないよう記入してください。",null,null,{"$f":"\"'\"&LEFTB(E46,3)&\"', '\"&LEFTB(E47,4)&\"', '\"&LEFTB(E50,1)&\"', '\"&LEFTB(E52,1)&\"', '\"&LEFTB(J52,1)&\"', '0', '\"&LEFTB(E54,10)&\"', '\"&LEFTB(E57,200)&\"', '\"&LEFTB(E58,40)&\"', '\"&LEFTB(E62,4)&\"', '\"&LEFTB(E63,11)&\"', '\"&LEFTB(E64,200)&\"', '\"&LEFTB(E65,6)&\"', '\"&LEFTB(E66,40)&\"'\"","v":"'', '', '0', '0', '0', '0', '経常費', '', '', '', '', '', '', ''"}]
[null,null,"時給単価",null,{"$f":"IF(ISERROR(VLOOKUP(E46,CD表!$I$3:$K$28,3,FALSE)),\"\",VLOOKUP(E46,CD表!$I$3:$K$28,3,FALSE))","v":""},null,null,"円","※B・C欄単価の場合記入（100円単位）",null,null,null,null,null,"時給単価","時給種別CDが995～999（B・C欄単価）の場合、必ず記入してください。"]
[null,null,"単価設定理由",null,null,null,null,null,null,null,null,null,null,null,"単価設定理由","時給種別CDが995～999（B・C欄単価）の場合、必ず記入してください。"]
[]
[null,null,"通勤交通費",null,"0.支給しない",null,null,null,null,null,null,null,null,null,"通勤交通費","プルダウンより選択してください。"]
[]
[null,null,"健康保険・厚生年金",null,"0.非加入",null,null,"雇用保険",null,"0.非加入",null,null,null,null,"健康保険・厚生年金／雇用保険","プルダウンより選択してください。"]
[]
[null,"4.　雇用資金源","資金種別",null,"経常費",null,null,null,null,null,null,null,null,null,"資金種別","プルダウンより選択してください。"]
[]
[null,null,"1. 経常費、SG経常費、間接経費、指定寄付を選択した場合",null,null,null,null,null,null,null,null,null,null,null,null,"1. 経常費、SG経常費、間接経費、指定寄付を選択した場合"]
[null,null,"資金名称",null,null,null,null,null,null,null,null,null,null,null,null,"　　資金名称"]
[null,null,"資金管理者名",null,null,null,null,null,null,null,null,null,null,null,null,"　　資金管理者名　　　　雇用契約書に資金源の記入が必要な場合は、資金名称や資金管理者を記入してください。"]
[null,null,"備考"]
[]
[null,null,"2. 外部資金を選択した場合",null,null,null,null,null,null,null,null,null,null,null,null,"2. 外部資金を選択した場合"]
[null,null,"年度",null,null,null,null,null,null,null,null,null,null,null,null,"　　年度：　　　　　　　該当年度を記入してください。"]
[null,null,"研究課題番号",null,null,null,null,null,null,null,null,null,null,null,null,"　　研究課題番号：　REVOLUTIONに登録の番号を記入してください。"]
[null,null,"研究課題名称",null,null,null,null,null,null,null,null,null,null,null,null,"　　研究課題名称：　雇用契約書上に、「資金源：【研究課題名称】」として印字されます。最大100文字です。"]
[null,null,"研究者コード",null,null,null,null,null,null,null,null,null,null,null,null,"　　研究者コード：　　資金代表者の教職員番号を記入してください。"]
[null,null,"研究者名",null,null,null,null,null,null,null,null,null,null,null,null,"　　研究者名：　　　  資金代表者の氏名を記入してください。資金代表者の教職員番号を記入してください。"]
[null,null,"備考",null,null,null,null,null,null,null,null,null,null,null,null,"　　備考：                事務連絡用に、特記事項があれば記入してください。（例：資金の略称名、通称名など）"]
[null,null,null,null,null,null,null,null,null,null,null,null,null,null,null,null,null,null,{"$f":"S69&\",\"&S72&\",\"&S75&\",\"&S78&\",\"&S81&\",\"&S107&\",\"&S113&\",\"&S119","v":"'', '','', '','', '','', '','', '','', '','', '','', '','', '','', '','', '','', '','', '', '', '','', '', '', '','', '', '', ''"}]
[null,"5.　申請者","勤務管理責任者1\n(所属長）","所属",null,null,null,null,null,null,null,null,null,null,"勤務管理責任者（所属長）","勤務管理責任者(所属長）とは、被雇用者の勤怠を管理し、勤務表の内容を承認する方を指します。\n従来の採用申請書の「申請者（資金代表者）」、「管理責任者」、「事務担当（※1）」を\n記入してください。",null,null,{"$f":"\"'\"&LEFTB($E70,6)&\"', '\"&LEFTB($I71,50)&\"'\"","v":"'', ''"}]
[null,null,null,"教職員番号",null,null,null,"氏名"]
[null,null,null,"身分","1.　教員",null,null,"e-mail"]
[null,null,"勤務管理責任者2\n（所属長）","所属",null,null,null,null,null,null,null,null,null,null,null,"（※1）従来の採用申請書の「事務担当」が右記の場合は、勤務管理責任者（所属長）の欄ではなく、",null,null,{"$f":"\"'\"&LEFTB($E73,6)&\"', '\"&LEFTB($I74,50)&\"'\"","v":"'', ''"}]
[null,null,null,"教職員番号",null,null,null,"氏名",null,null,null,null,null,null,null,"　　　　【管轄事務担当】の欄に記入してください。"]
[null,null,null,"身分","1.　教員",null,null,"e-mail"]
[null,null,"勤務管理責任者3\n(所属長）","所属",null,null,null,null,null,null,null,null,null,null,"e-mail","職員の方でADSTmailを利用している場合は、入力不要です。教職員番号は必ず記入してください。",null,null,{"$f":"\"'\"&LEFTB($E76,6)&\"', '\"&LEFTB($I77,50)&\"'\"","v":"'', ''"}]
[null,null,null,"教職員番号",null,null,null,"氏名"]
[null,null,null,"身分","2.　職員",null,null,"e-mail"]
[null,null,"勤務管理責任者4\n（所属長）","所属",null,null,null,null,null,null,null,null,null,null,null,null,null,null,{"$f":"\"'\"&LEFTB($E79,6)&\"', '\"&LEFTB($I80,50)&\"'\"","v":"'', ''"}]
[null,null,null,"教職員番号",null,null,null,"氏名"]
[null,null,null,"身分","2.　職員",null,null,"e-mail"]
{"$rows_left_out":113}
{"sheet":"採用申請提出方法","index":1,"n_rows":34,"n_cols":3,"rows_kept":34,"cut":false,"hidden":false,"merged":[]}
[]
[null,"採用申請書提出方法について"]
[]
[null,"※以下、提出担当所属の方へのご連絡です。"]
[]
[null,"＜提出担当所属＞"]
[null,"地区　","提出担当所属"]
[null,"三田","従来の採用申請書の「事務担当」所属"]
[null,"日吉","運営サービス"]
[null,"志木","志木高等学校事務室"]
[null,"湘南藤沢","総務担当"]
[null,"湘南藤沢（看護）","看護医療学部担当"]
[null,"湘南藤沢（SFC中高）","湘南藤沢中・高等部事務室"]
[null,"矢上","総務課"]
[null,"芝","総務課"]
[]
[null,"＜人事部人事企画担当への提出方法＞"]
[null,"プリントアウトした採用申請書と電子データの両方をご提出いただきます。"]
[null,"以下①②の両方の提出をもって申請完了となりますので、ご注意ください。"]
[null,"なお、両方の提出が確認できない場合、①と②の内容に齟齬がある場合には、人事部人事企画担当より提出担当所属の方へ"]
[null,"ご連絡いたします。"]
[]
[null,"①  プリントアウトした採用申請書"]
[null,"採用申請書の必要項目の記入・確認が完了しましたら、提出担当所属にてプリントアウトし、右下の余白に受付印を押印のうえ、"]
[null,"人事部人事企画担当まで提出してください。"]
[]
[null,"②  電子データ"]
[null,"採用申請書の必要項目の記入・確認が完了しましたら、提出担当所属にて、採用申請書左下の【送信】ボタンを押してください。"]
[null,"送信ボタンが押されると、人事部人事企画担当に申請書の内容が送信され、電子データの提出が自動的に完了します。"]
[]
[null,"・提出担当所属以外の方がボタンを押した場合、その申請は受理されません。"]
[null,"・同一の申請を誤って複数回送信した場合は、最後に送信された情報を受理します。"]
[null,"・送信エラーのメッセージが表示された場合には、エクセルファイルを <ar-jinji@adst.keio.ac.jp> 宛に提出してください。"]
[null,"　その場合にも、プリントアウトした採用申請書のご提出をお願いいたします。"]

{"sheet":"CD表","index":2,"n_rows":547,"n_cols":12,"rows_kept":547,"cut":false,"hidden":false,"merged":[]}
[]
["地区","所属CD","所属名",null,"地区CD","勤務地区",null,"地区","時給種別CD","時給種別","金額","備考"]
["三田","0500000","経営改革推進室",null,"01","三田",null,"本塾",101,"一般事務・技術",1100,"一般、本塾科目等履修生、本塾特別聴講生、本塾研究生"]
["三田","0600000","グローバル本部",null,"02","日吉",null,"本塾",104,"一般事務・技術（鶴岡）",950,"101に該当する方のうち、鶴岡タウンキャンパスにおける勤務の場合"]
["三田","1000000","塾監局",null,"03","志木",null,"本塾",111,"大学院生（本塾）",1100,"本塾正規学生（大学院生）、本塾特別留学生（大学院生）、本塾別科生（大学院生）"]
["三田","1000530","塾監局　出向(事業会)",null,"04","SFC",null,"本塾",113,"大学院生（他大学）",1100,"他大学院生"]
["三田","1050000","総務部",null,"05","矢上",null,"本塾",114,"大学院生（本塾＿鶴岡）",1100,"111に該当する方のうち、鶴岡タウンキャンパスにおける勤務の場合"]
["三田","1050010","総務部総務担当",null,"06","信濃町",null,"本塾",115,"大学院生（他大学＿鶴岡）",1100,"113に該当する方のうち、鶴岡タウンキャンパスにおける勤務の場合"]
["三田","1100000","人事部",null,"09","芝",null,"本塾",121,"大学生（本塾）",1050,"本塾正規学生（学部生）、本塾特別留学生（学部生）、本塾別科生（学部生）"]
["三田","1100010","人事部人事企画担当",null,99,"その他（O列に勤務地入力）",null,"本塾",123,"大学生（通信教育部）",1050,"通信教育課程･科目試験監督・科目試験監督補助の場合"]
["三田","1100020","人事部給与厚生担当",null,null,null,null,"本塾",124,"大学生（他大学）",1050,"他大学部生"]
["三田","1100025","人事部健保担当",null,"国名CD","国名",null,"本塾",125,"大学生（本塾＿鶴岡）",1050,"121に該当する方のうち、鶴岡タウンキャンパスにおける勤務の場合"]
["三田","1150000","経理部",null,"032","アルゼンチン",null,"本塾",126,"大学生（他大学＿鶴岡）",1050,"124に該当する方のうち、鶴岡タウンキャンパスにおける勤務の場合"]
["三田","1150010","経理部経理担当",null,"036","オーストラリア",null,"本塾",131,"高校生（本塾）",1050]
["三田","1150020","経理部資産運用担当",null,"040","オーストリア",null,"本塾",132,"高校生（鶴岡）",870,"131に該当する方のうち、鶴岡タウンキャンパスにおける勤務の場合"]
["三田","1200000","管財部",null,"050","バングラデシュ",null,"本塾",463,"実習指導者（看護医療学部＿一般）",3000]
["三田","1200501","管財部　管財担当",null,"056","ベルギー",null,"本塾",464,"実習指導者（看護医療学部＿本塾大学院生）",3000]
["三田","1200701","管財部　レジデンシャル担当",null,"076","ブラジル",null,"本塾",465,"実習指導者（看護医療学部＿他大学院生）",3000]
["三田","1201001","管財部　工務担当",null,"100","ブルガリア",null,"本塾",670,"保セ",1500,"大学保健管理センター業務"]
["三田","1201501","管財部　施設担当",null,"116","カンボジア",null,"本塾",671,"保セ（特例1）",1900,"一貫校保健室、矢上・芝共立分室業務"]
["三田","1260000","学生部",null,"124","カナダ",null,"本塾",672,"保セ（特例2）",1900,"スーパーナースからの紹介者"]
["三田","1260050","学生部総務・総合窓口",null,"152","チリ",null,"本塾",673,"保セ（特例3）",2700,"健診期間中の会場勤務・留守番"]
["三田","1260160","学生部学事",null,"156","中国",null,"本塾",674,"保セ（カウンセラー）",5500,"メンタルヘルス担当カウンセラー"]
["三田","1260220","学生部国際交流支援",null,"158","台湾（中華民国）",null,"本塾",995,"その他（期末手当無_本塾大学生）",0,"B・C欄単価適用の場合（本塾正規学生（学部生）、本塾特別留学生（学部生）、本塾別科生（学部生））"]
["三田","1260310","学生部学生生活支援",null,"170","コロンビア",null,"本塾",996,"その他（期末手当無_本塾大学院生）",0,"B・C欄単価適用の場合（本塾正規学生（大学院生）、本塾特別留学生（大学院生）、本塾別科生（大学院生））"]
["三田","1260315","学生部福利厚生支援",null,"188","コスタリカ",null,"本塾",997,"その他（期末手当無_他大学生）",0,"B・C欄単価適用の場合（他大学部生）"]
["三田","1260320","学生部就職・進路・教職課程",null,"192","キューバ",null,"本塾",998,"その他（期末手当無_他大学院生）",0,"B・C欄単価適用の場合（他大学院生）"]
["三田","1320000","基金室",null,"208","デンマーク",null,"本塾",999,"その他（期末手当無）",0,"B・C欄単価適用の場合（一般、本塾科目等履修生、本塾特別聴講生、本塾研究生）"]
["三田","1340000","塾員センター",null,"246","フィンランド"]
["三田","1400000","入学センター",null,"250","フランス"]
["三田","1420000","一貫教育支援センター",null,"276","ドイツ"]
["三田","1430000","学術事業連携室",null,"300","ギリシャ"]
["三田","1450000","研究所事務センター",null,"348","ハンガリー"]
["三田","1460000","立科山荘管理室",null,"352","アイスランド"]
["日吉","1510000","日吉事務センター",null,"356","インド"]
["日吉","1510010","日吉事務運営サービス",null,"360","インドネシア"]
["日吉","1510020","日吉事務施設環境",null,"364","イラン"]
["日吉","1510500","日吉事務セ　教室関係",null,"368","イラク"]
["日吉","1512000","日吉学生部",null,"372","アイルランド"]
["日吉","1512010","日吉学生部学事",null,"380","イタリア"]
["日吉","1512020","日吉学生部学習環境",null,"388","ジャマイカ"]
["日吉","1512030","日吉学生部大学院",null,"392","日本"]
["日吉","1512110","日吉学生部学生生活",null,"408","朝鮮民主主義人民共和国"]
["日吉","1512120","日吉学生部学生相談",null,"410","大韓民国"]
["日吉","1512190","日吉寄宿舎",null,"418","ラオス"]
["日吉","1512210","日吉学生部国際",null,"458","マレーシア"]
["日吉","1513100","日吉学術研究支援課",null,"484","メキシコ"]
["三田","1550100","塾長室",null,"496","モンゴル"]
["三田","1550110","塾長室秘書担当",null,"504","モロッコ"]
["三田","1550300","広報室",null,"524","ネパール"]
["信濃町","1551500","医学振興基金事務室",null,"528","オランダ"]
["三田","1551810","ITC本部",null,"554","ニュージーランド"]
["三田","1551812","ITC本部総務担当",null,"566","ナイジェリア"]
["三田","1551815","ITC本部情報システム担当",null,"578","ノルウェー"]
["三田","1551820","三田ITC",null,"604","ペルー"]
["日吉","1551830","日吉ITC",null,"608","フィリピン"]
["信濃町","1551840","信濃町ITC",null,"616","ポーランド"]
["矢上","1551850","理工学ITC",null,"620","ポルトガル"]
["湘南藤沢","1551860","湘南藤沢ITC",null,"643","ロシア"]
["芝共立","1551870","芝共立ITC",null,"682","サウジアラビア"]
["日吉","1552000","日吉診療所",null,"702","シンガポール"]
["三田","1552010","三田診療所",null,"704","ベトナム"]
["湘南藤沢","1552020","湘南藤沢診療所",null,"710","南アフリカ"]
["矢上","1552030","矢上診療所",null,"724","スペイン"]
["三田","1552600","業務監査室",null,"752","スウェーデン"]
["三田","1552800","個人情報保護管理室",null,"756","スイス"]
["三田","1553010","ハラス防止委員会事務",null,"764","タイ"]
["三田","1556900","協生環境推進室",null,"784","アラブ首長国連邦"]
["三田","2000000","大学院　文学研究科",null,"792","トルコ"]
["三田","2000500","文学部",null,"804","ウクライナ"]
["日吉","2001000","文学部　語学",null,"818","エジプト"]
["日吉","2001500","文学部　一般",null,"826","英国"]
["三田","2004510","文学部　人文哲学系",null,"840","米国"]
["三田","2004520","文学部　人文史学系",null,"860","ウズベキスタン"]
["三田","2004530","文学部　人文文学系"]
["三田","2004540","文学部　人文図書情系"]
["三田","2004550","文学部　人文人関系"]
["三田","2100000","大学院　経済学研究科"]
["三田","2100500","経済学部"]
["日吉","2101000","経済学部　語学"]
{"$rows_left_out":468}
{"sheet":"労働条件記入方法","index":3,"n_rows":24,"n_cols":43,"rows_kept":24,"cut":false,"hidden":false,"merged":[[1,2,2,12]]}
[]
[null,null,"労働条件記入方法"]
[]
[]
[]
[]
[null,null,null,null,null,null,null,null,null,null,null,null,null,null,null,null,null,null,null,null,"はい",null,null,null,null,null,null,null,null,null,null,null,null,"いいえ"]
[]
[]
[]
[]
[]
[]
[]
[]
[]
[]
[]
[]
[]
[]
[]
[]
[null,null,null,null,null,null,null,null,null,null,null,null,null,null,null,null,null,null,null,null,null,null,null,null,"はい",null,null,null,null,null,null,null,null,null,null,null,null,null,null,null,null,null,"いいえ"]